Untitled

From Putrid Hamster, 9 Years ago, written in Plain Text, viewed 645 times. This paste will croak in 1 Second.
URL https://paste.godclan.hu/view/xSSqNdZI Embed
Download Paste or View Raw
  1. /bin/sh ../../libtool  --tag=CXX --tag=disable-static  --mode=compile g++ -DHAVE_CONFIG_H -I. -I../.. -I./../sdk/ -I./../../vendor/tinyxml/  -O2 -fPIC -DPIC -Wall -DTIXML_USE_STL -Winvalid-pch -O2 -fPIC -DPIC -MT xmll_la-CXMLImpl.lo -MD -MP -MF .deps/xmll_la-CXMLImpl.Tpo -c -o xmll_la-CXMLImpl.lo `test -f 'CXMLImpl.cpp' || echo './'`CXMLImpl.cpp
  2. libtool: compile:  g++ -DHAVE_CONFIG_H -I. -I../.. -I./../sdk/ -I./../../vendor/tinyxml/ -O2 -fPIC -DPIC -Wall -DTIXML_USE_STL -Winvalid-pch -O2 -fPIC -DPIC -MT xmll_la-CXMLImpl.lo -MD -MP -MF .deps/xmll_la-CXMLImpl.Tpo -c CXMLImpl.cpp  -fPIC -DPIC -o .libs/xmll_la-CXMLImpl.o
  3. In file included from ./../sdk/SharedUtil.hpp:19:0,
  4.                  from CXMLImpl.cpp:19:
  5. ./../sdk/SharedUtil.Misc.hpp:1708:1: error: ‘MTAEXPORT’ does not name a type
  6. In file included from ./../sdk/SharedUtil.hpp:24:0,
  7.                  from CXMLImpl.cpp:19:
  8. ./../sdk/SharedUtil.Hash.hpp: In member function ‘void SharedUtil::CMD5Hasher::Transform(unsigned char*)’:
  9. ./../sdk/SharedUtil.Hash.hpp:224:29: error: invalid conversion from ‘unsigned int*’ to ‘long unsigned int*’ [-fpermissive]
  10. ./../sdk/SharedUtil.Hash.h:41:41: error:   initializing argument 1 of ‘static void SharedUtil::CMD5Hasher::Decode(long unsigned int*, unsigned char*, long unsigned int)’ [-fpermissive]
  11. ./../sdk/SharedUtil.Hash.hpp:227:47: error: no matching function for call to ‘SharedUtil::CMD5Hasher::FF(unsigned int&, unsigned int&, unsigned int&, unsigned int&, unsigned int&, int, unsigned int)’
  12. ./../sdk/SharedUtil.Hash.hpp:227:47: note: candidate is:
  13. ./../sdk/SharedUtil.Hash.h:48:41: note: static void SharedUtil::CMD5Hasher::FF(long unsigned int&, long unsigned int, long unsigned int, long unsigned int, long unsigned int, long unsigned int, long unsigned int)
  14. ./../sdk/SharedUtil.Hash.h:48:41: note:   no known conversion for argument 1 from ‘unsigned int’ to ‘long unsigned int&’
  15. ./../sdk/SharedUtil.Hash.hpp:228:47: error: no matching function for call to ‘SharedUtil::CMD5Hasher::FF(unsigned int&, unsigned int&, unsigned int&, unsigned int&, unsigned int&, int, unsigned int)’
  16. ./../sdk/SharedUtil.Hash.hpp:228:47: note: candidate is:
  17. ./../sdk/SharedUtil.Hash.h:48:41: note: static void SharedUtil::CMD5Hasher::FF(long unsigned int&, long unsigned int, long unsigned int, long unsigned int, long unsigned int, long unsigned int, long unsigned int)
  18. ./../sdk/SharedUtil.Hash.h:48:41: note:   no known conversion for argument 1 from ‘unsigned int’ to ‘long unsigned int&’
  19. ./../sdk/SharedUtil.Hash.hpp:229:47: error: no matching function for call to ‘SharedUtil::CMD5Hasher::FF(unsigned int&, unsigned int&, unsigned int&, unsigned int&, unsigned int&, int, int)’
  20. ./../sdk/SharedUtil.Hash.hpp:229:47: note: candidate is:
  21. ./../sdk/SharedUtil.Hash.h:48:41: note: static void SharedUtil::CMD5Hasher::FF(long unsigned int&, long unsigned int, long unsigned int, long unsigned int, long unsigned int, long unsigned int, long unsigned int)
  22. ./../sdk/SharedUtil.Hash.h:48:41: note:   no known conversion for argument 1 from ‘unsigned int’ to ‘long unsigned int&’
  23. ./../sdk/SharedUtil.Hash.hpp:230:47: error: no matching function for call to ‘SharedUtil::CMD5Hasher::FF(unsigned int&, unsigned int&, unsigned int&, unsigned int&, unsigned int&, int, unsigned int)’
  24. ./../sdk/SharedUtil.Hash.hpp:230:47: note: candidate is:
  25. ./../sdk/SharedUtil.Hash.h:48:41: note: static void SharedUtil::CMD5Hasher::FF(long unsigned int&, long unsigned int, long unsigned int, long unsigned int, long unsigned int, long unsigned int, long unsigned int)
  26. ./../sdk/SharedUtil.Hash.h:48:41: note:   no known conversion for argument 1 from ‘unsigned int’ to ‘long unsigned int&’
  27. ./../sdk/SharedUtil.Hash.hpp:231:47: error: no matching function for call to ‘SharedUtil::CMD5Hasher::FF(unsigned int&, unsigned int&, unsigned int&, unsigned int&, unsigned int&, int, unsigned int)’
  28. ./../sdk/SharedUtil.Hash.hpp:231:47: note: candidate is:
  29. ./../sdk/SharedUtil.Hash.h:48:41: note: static void SharedUtil::CMD5Hasher::FF(long unsigned int&, long unsigned int, long unsigned int, long unsigned int, long unsigned int, long unsigned int, long unsigned int)
  30. ./../sdk/SharedUtil.Hash.h:48:41: note:   no known conversion for argument 1 from ‘unsigned int’ to ‘long unsigned int&’
  31. ./../sdk/SharedUtil.Hash.hpp:232:47: error: no matching function for call to ‘SharedUtil::CMD5Hasher::FF(unsigned int&, unsigned int&, unsigned int&, unsigned int&, unsigned int&, int, int)’
  32. ./../sdk/SharedUtil.Hash.hpp:232:47: note: candidate is:
  33. ./../sdk/SharedUtil.Hash.h:48:41: note: static void SharedUtil::CMD5Hasher::FF(long unsigned int&, long unsigned int, long unsigned int, long unsigned int, long unsigned int, long unsigned int, long unsigned int)
  34. ./../sdk/SharedUtil.Hash.h:48:41: note:   no known conversion for argument 1 from ‘unsigned int’ to ‘long unsigned int&’
  35. ./../sdk/SharedUtil.Hash.hpp:233:47: error: no matching function for call to ‘SharedUtil::CMD5Hasher::FF(unsigned int&, unsigned int&, unsigned int&, unsigned int&, unsigned int&, int, unsigned int)’
  36. ./../sdk/SharedUtil.Hash.hpp:233:47: note: candidate is:
  37. ./../sdk/SharedUtil.Hash.h:48:41: note: static void SharedUtil::CMD5Hasher::FF(long unsigned int&, long unsigned int, long unsigned int, long unsigned int, long unsigned int, long unsigned int, long unsigned int)
  38. ./../sdk/SharedUtil.Hash.h:48:41: note:   no known conversion for argument 1 from ‘unsigned int’ to ‘long unsigned int&’
  39. ./../sdk/SharedUtil.Hash.hpp:234:47: error: no matching function for call to ‘SharedUtil::CMD5Hasher::FF(unsigned int&, unsigned int&, unsigned int&, unsigned int&, unsigned int&, int, unsigned int)’
  40. ./../sdk/SharedUtil.Hash.hpp:234:47: note: candidate is:
  41. ./../sdk/SharedUtil.Hash.h:48:41: note: static void SharedUtil::CMD5Hasher::FF(long unsigned int&, long unsigned int, long unsigned int, long unsigned int, long unsigned int, long unsigned int, long unsigned int)
  42. ./../sdk/SharedUtil.Hash.h:48:41: note:   no known conversion for argument 1 from ‘unsigned int’ to ‘long unsigned int&’
  43. ./../sdk/SharedUtil.Hash.hpp:235:47: error: no matching function for call to ‘SharedUtil::CMD5Hasher::FF(unsigned int&, unsigned int&, unsigned int&, unsigned int&, unsigned int&, int, int)’
  44. ./../sdk/SharedUtil.Hash.hpp:235:47: note: candidate is:
  45. ./../sdk/SharedUtil.Hash.h:48:41: note: static void SharedUtil::CMD5Hasher::FF(long unsigned int&, long unsigned int, long unsigned int, long unsigned int, long unsigned int, long unsigned int, long unsigned int)
  46. ./../sdk/SharedUtil.Hash.h:48:41: note:   no known conversion for argument 1 from ‘unsigned int’ to ‘long unsigned int&’
  47. ./../sdk/SharedUtil.Hash.hpp:236:47: error: no matching function for call to ‘SharedUtil::CMD5Hasher::FF(unsigned int&, unsigned int&, unsigned int&, unsigned int&, unsigned int&, int, unsigned int)’
  48. ./../sdk/SharedUtil.Hash.hpp:236:47: note: candidate is:
  49. ./../sdk/SharedUtil.Hash.h:48:41: note: static void SharedUtil::CMD5Hasher::FF(long unsigned int&, long unsigned int, long unsigned int, long unsigned int, long unsigned int, long unsigned int, long unsigned int)
  50. ./../sdk/SharedUtil.Hash.h:48:41: note:   no known conversion for argument 1 from ‘unsigned int’ to ‘long unsigned int&’
  51. ./../sdk/SharedUtil.Hash.hpp:237:47: error: no matching function for call to ‘SharedUtil::CMD5Hasher::FF(unsigned int&, unsigned int&, unsigned int&, unsigned int&, unsigned int&, int, unsigned int)’
  52. ./../sdk/SharedUtil.Hash.hpp:237:47: note: candidate is:
  53. ./../sdk/SharedUtil.Hash.h:48:41: note: static void SharedUtil::CMD5Hasher::FF(long unsigned int&, long unsigned int, long unsigned int, long unsigned int, long unsigned int, long unsigned int, long unsigned int)
  54. ./../sdk/SharedUtil.Hash.h:48:41: note:   no known conversion for argument 1 from ‘unsigned int’ to ‘long unsigned int&’
  55. ./../sdk/SharedUtil.Hash.hpp:238:47: error: no matching function for call to ‘SharedUtil::CMD5Hasher::FF(unsigned int&, unsigned int&, unsigned int&, unsigned int&, unsigned int&, int, unsigned int)’
  56. ./../sdk/SharedUtil.Hash.hpp:238:47: note: candidate is:
  57. ./../sdk/SharedUtil.Hash.h:48:41: note: static void SharedUtil::CMD5Hasher::FF(long unsigned int&, long unsigned int, long unsigned int, long unsigned int, long unsigned int, long unsigned int, long unsigned int)
  58. ./../sdk/SharedUtil.Hash.h:48:41: note:   no known conversion for argument 1 from ‘unsigned int’ to ‘long unsigned int&’
  59. ./../sdk/SharedUtil.Hash.hpp:239:47: error: no matching function for call to ‘SharedUtil::CMD5Hasher::FF(unsigned int&, unsigned int&, unsigned int&, unsigned int&, unsigned int&, int, int)’
  60. ./../sdk/SharedUtil.Hash.hpp:239:47: note: candidate is:
  61. ./../sdk/SharedUtil.Hash.h:48:41: note: static void SharedUtil::CMD5Hasher::FF(long unsigned int&, long unsigned int, long unsigned int, long unsigned int, long unsigned int, long unsigned int, long unsigned int)
  62. ./../sdk/SharedUtil.Hash.h:48:41: note:   no known conversion for argument 1 from ‘unsigned int’ to ‘long unsigned int&’
  63. ./../sdk/SharedUtil.Hash.hpp:240:47: error: no matching function for call to ‘SharedUtil::CMD5Hasher::FF(unsigned int&, unsigned int&, unsigned int&, unsigned int&, unsigned int&, int, unsigned int)’
  64. ./../sdk/SharedUtil.Hash.hpp:240:47: note: candidate is:
  65. ./../sdk/SharedUtil.Hash.h:48:41: note: static void SharedUtil::CMD5Hasher::FF(long unsigned int&, long unsigned int, long unsigned int, long unsigned int, long unsigned int, long unsigned int, long unsigned int)
  66. ./../sdk/SharedUtil.Hash.h:48:41: note:   no known conversion for argument 1 from ‘unsigned int’ to ‘long unsigned int&’
  67. ./../sdk/SharedUtil.Hash.hpp:241:47: error: no matching function for call to ‘SharedUtil::CMD5Hasher::FF(unsigned int&, unsigned int&, unsigned int&, unsigned int&, unsigned int&, int, unsigned int)’
  68. ./../sdk/SharedUtil.Hash.hpp:241:47: note: candidate is:
  69. ./../sdk/SharedUtil.Hash.h:48:41: note: static void SharedUtil::CMD5Hasher::FF(long unsigned int&, long unsigned int, long unsigned int, long unsigned int, long unsigned int, long unsigned int, long unsigned int)
  70. ./../sdk/SharedUtil.Hash.h:48:41: note:   no known conversion for argument 1 from ‘unsigned int’ to ‘long unsigned int&’
  71. ./../sdk/SharedUtil.Hash.hpp:242:47: error: no matching function for call to ‘SharedUtil::CMD5Hasher::FF(unsigned int&, unsigned int&, unsigned int&, unsigned int&, unsigned int&, int, int)’
  72. ./../sdk/SharedUtil.Hash.hpp:242:47: note: candidate is:
  73. ./../sdk/SharedUtil.Hash.h:48:41: note: static void SharedUtil::CMD5Hasher::FF(long unsigned int&, long unsigned int, long unsigned int, long unsigned int, long unsigned int, long unsigned int, long unsigned int)
  74. ./../sdk/SharedUtil.Hash.h:48:41: note:   no known conversion for argument 1 from ‘unsigned int’ to ‘long unsigned int&’
  75. ./../sdk/SharedUtil.Hash.hpp:245:47: error: no matching function for call to ‘SharedUtil::CMD5Hasher::GG(unsigned int&, unsigned int&, unsigned int&, unsigned int&, unsigned int&, int, unsigned int)’
  76. ./../sdk/SharedUtil.Hash.hpp:245:47: note: candidate is:
  77. ./../sdk/SharedUtil.Hash.h:49:41: note: static void SharedUtil::CMD5Hasher::GG(long unsigned int&, long unsigned int, long unsigned int, long unsigned int, long unsigned int, long unsigned int, long unsigned int)
  78. ./../sdk/SharedUtil.Hash.h:49:41: note:   no known conversion for argument 1 from ‘unsigned int’ to ‘long unsigned int&’
  79. ./../sdk/SharedUtil.Hash.hpp:246:47: error: no matching function for call to ‘SharedUtil::CMD5Hasher::GG(unsigned int&, unsigned int&, unsigned int&, unsigned int&, unsigned int&, int, unsigned int)’
  80. ./../sdk/SharedUtil.Hash.hpp:246:47: note: candidate is:
  81. ./../sdk/SharedUtil.Hash.h:49:41: note: static void SharedUtil::CMD5Hasher::GG(long unsigned int&, long unsigned int, long unsigned int, long unsigned int, long unsigned int, long unsigned int, long unsigned int)
  82. ./../sdk/SharedUtil.Hash.h:49:41: note:   no known conversion for argument 1 from ‘unsigned int’ to ‘long unsigned int&’
  83. ./../sdk/SharedUtil.Hash.hpp:247:47: error: no matching function for call to ‘SharedUtil::CMD5Hasher::GG(unsigned int&, unsigned int&, unsigned int&, unsigned int&, unsigned int&, int, int)’
  84. ./../sdk/SharedUtil.Hash.hpp:247:47: note: candidate is:
  85. ./../sdk/SharedUtil.Hash.h:49:41: note: static void SharedUtil::CMD5Hasher::GG(long unsigned int&, long unsigned int, long unsigned int, long unsigned int, long unsigned int, long unsigned int, long unsigned int)
  86. ./../sdk/SharedUtil.Hash.h:49:41: note:   no known conversion for argument 1 from ‘unsigned int’ to ‘long unsigned int&’
  87. ./../sdk/SharedUtil.Hash.hpp:248:47: error: no matching function for call to ‘SharedUtil::CMD5Hasher::GG(unsigned int&, unsigned int&, unsigned int&, unsigned int&, unsigned int&, int, unsigned int)’
  88. ./../sdk/SharedUtil.Hash.hpp:248:47: note: candidate is:
  89. ./../sdk/SharedUtil.Hash.h:49:41: note: static void SharedUtil::CMD5Hasher::GG(long unsigned int&, long unsigned int, long unsigned int, long unsigned int, long unsigned int, long unsigned int, long unsigned int)
  90. ./../sdk/SharedUtil.Hash.h:49:41: note:   no known conversion for argument 1 from ‘unsigned int’ to ‘long unsigned int&’
  91. ./../sdk/SharedUtil.Hash.hpp:249:47: error: no matching function for call to ‘SharedUtil::CMD5Hasher::GG(unsigned int&, unsigned int&, unsigned int&, unsigned int&, unsigned int&, int, unsigned int)’
  92. ./../sdk/SharedUtil.Hash.hpp:249:47: note: candidate is:
  93. ./../sdk/SharedUtil.Hash.h:49:41: note: static void SharedUtil::CMD5Hasher::GG(long unsigned int&, long unsigned int, long unsigned int, long unsigned int, long unsigned int, long unsigned int, long unsigned int)
  94. ./../sdk/SharedUtil.Hash.h:49:41: note:   no known conversion for argument 1 from ‘unsigned int’ to ‘long unsigned int&’
  95. ./../sdk/SharedUtil.Hash.hpp:250:47: error: no matching function for call to ‘SharedUtil::CMD5Hasher::GG(unsigned int&, unsigned int&, unsigned int&, unsigned int&, unsigned int&, int, int)’
  96. ./../sdk/SharedUtil.Hash.hpp:250:47: note: candidate is:
  97. ./../sdk/SharedUtil.Hash.h:49:41: note: static void SharedUtil::CMD5Hasher::GG(long unsigned int&, long unsigned int, long unsigned int, long unsigned int, long unsigned int, long unsigned int, long unsigned int)
  98. ./../sdk/SharedUtil.Hash.h:49:41: note:   no known conversion for argument 1 from ‘unsigned int’ to ‘long unsigned int&’
  99. ./../sdk/SharedUtil.Hash.hpp:251:47: error: no matching function for call to ‘SharedUtil::CMD5Hasher::GG(unsigned int&, unsigned int&, unsigned int&, unsigned int&, unsigned int&, int, unsigned int)’
  100. ./../sdk/SharedUtil.Hash.hpp:251:47: note: candidate is:
  101. ./../sdk/SharedUtil.Hash.h:49:41: note: static void SharedUtil::CMD5Hasher::GG(long unsigned int&, long unsigned int, long unsigned int, long unsigned int, long unsigned int, long unsigned int, long unsigned int)
  102. ./../sdk/SharedUtil.Hash.h:49:41: note:   no known conversion for argument 1 from ‘unsigned int’ to ‘long unsigned int&’
  103. ./../sdk/SharedUtil.Hash.hpp:252:47: error: no matching function for call to ‘SharedUtil::CMD5Hasher::GG(unsigned int&, unsigned int&, unsigned int&, unsigned int&, unsigned int&, int, unsigned int)’
  104. ./../sdk/SharedUtil.Hash.hpp:252:47: note: candidate is:
  105. ./../sdk/SharedUtil.Hash.h:49:41: note: static void SharedUtil::CMD5Hasher::GG(long unsigned int&, long unsigned int, long unsigned int, long unsigned int, long unsigned int, long unsigned int, long unsigned int)
  106. ./../sdk/SharedUtil.Hash.h:49:41: note:   no known conversion for argument 1 from ‘unsigned int’ to ‘long unsigned int&’
  107. ./../sdk/SharedUtil.Hash.hpp:253:47: error: no matching function for call to ‘SharedUtil::CMD5Hasher::GG(unsigned int&, unsigned int&, unsigned int&, unsigned int&, unsigned int&, int, int)’
  108. ./../sdk/SharedUtil.Hash.hpp:253:47: note: candidate is:
  109. ./../sdk/SharedUtil.Hash.h:49:41: note: static void SharedUtil::CMD5Hasher::GG(long unsigned int&, long unsigned int, long unsigned int, long unsigned int, long unsigned int, long unsigned int, long unsigned int)
  110. ./../sdk/SharedUtil.Hash.h:49:41: note:   no known conversion for argument 1 from ‘unsigned int’ to ‘long unsigned int&’
  111. ./../sdk/SharedUtil.Hash.hpp:254:47: error: no matching function for call to ‘SharedUtil::CMD5Hasher::GG(unsigned int&, unsigned int&, unsigned int&, unsigned int&, unsigned int&, int, unsigned int)’
  112. ./../sdk/SharedUtil.Hash.hpp:254:47: note: candidate is:
  113. ./../sdk/SharedUtil.Hash.h:49:41: note: static void SharedUtil::CMD5Hasher::GG(long unsigned int&, long unsigned int, long unsigned int, long unsigned int, long unsigned int, long unsigned int, long unsigned int)
  114. ./../sdk/SharedUtil.Hash.h:49:41: note:   no known conversion for argument 1 from ‘unsigned int’ to ‘long unsigned int&’
  115. ./../sdk/SharedUtil.Hash.hpp:255:47: error: no matching function for call to ‘SharedUtil::CMD5Hasher::GG(unsigned int&, unsigned int&, unsigned int&, unsigned int&, unsigned int&, int, unsigned int)’
  116. ./../sdk/SharedUtil.Hash.hpp:255:47: note: candidate is:
  117. ./../sdk/SharedUtil.Hash.h:49:41: note: static void SharedUtil::CMD5Hasher::GG(long unsigned int&, long unsigned int, long unsigned int, long unsigned int, long unsigned int, long unsigned int, long unsigned int)
  118. ./../sdk/SharedUtil.Hash.h:49:41: note:   no known conversion for argument 1 from ‘unsigned int’ to ‘long unsigned int&’
  119. ./../sdk/SharedUtil.Hash.hpp:256:47: error: no matching function for call to ‘SharedUtil::CMD5Hasher::GG(unsigned int&, unsigned int&, unsigned int&, unsigned int&, unsigned int&, int, int)’
  120. ./../sdk/SharedUtil.Hash.hpp:256:47: note: candidate is:
  121. ./../sdk/SharedUtil.Hash.h:49:41: note: static void SharedUtil::CMD5Hasher::GG(long unsigned int&, long unsigned int, long unsigned int, long unsigned int, long unsigned int, long unsigned int, long unsigned int)
  122. ./../sdk/SharedUtil.Hash.h:49:41: note:   no known conversion for argument 1 from ‘unsigned int’ to ‘long unsigned int&’
  123. ./../sdk/SharedUtil.Hash.hpp:257:47: error: no matching function for call to ‘SharedUtil::CMD5Hasher::GG(unsigned int&, unsigned int&, unsigned int&, unsigned int&, unsigned int&, int, unsigned int)’
  124. ./../sdk/SharedUtil.Hash.hpp:257:47: note: candidate is:
  125. ./../sdk/SharedUtil.Hash.h:49:41: note: static void SharedUtil::CMD5Hasher::GG(long unsigned int&, long unsigned int, long unsigned int, long unsigned int, long unsigned int, long unsigned int, long unsigned int)
  126. ./../sdk/SharedUtil.Hash.h:49:41: note:   no known conversion for argument 1 from ‘unsigned int’ to ‘long unsigned int&’
  127. ./../sdk/SharedUtil.Hash.hpp:258:47: error: no matching function for call to ‘SharedUtil::CMD5Hasher::GG(unsigned int&, unsigned int&, unsigned int&, unsigned int&, unsigned int&, int, unsigned int)’
  128. ./../sdk/SharedUtil.Hash.hpp:258:47: note: candidate is:
  129. ./../sdk/SharedUtil.Hash.h:49:41: note: static void SharedUtil::CMD5Hasher::GG(long unsigned int&, long unsigned int, long unsigned int, long unsigned int, long unsigned int, long unsigned int, long unsigned int)
  130. ./../sdk/SharedUtil.Hash.h:49:41: note:   no known conversion for argument 1 from ‘unsigned int’ to ‘long unsigned int&’
  131. ./../sdk/SharedUtil.Hash.hpp:259:47: error: no matching function for call to ‘SharedUtil::CMD5Hasher::GG(unsigned int&, unsigned int&, unsigned int&, unsigned int&, unsigned int&, int, int)’
  132. ./../sdk/SharedUtil.Hash.hpp:259:47: note: candidate is:
  133. ./../sdk/SharedUtil.Hash.h:49:41: note: static void SharedUtil::CMD5Hasher::GG(long unsigned int&, long unsigned int, long unsigned int, long unsigned int, long unsigned int, long unsigned int, long unsigned int)
  134. ./../sdk/SharedUtil.Hash.h:49:41: note:   no known conversion for argument 1 from ‘unsigned int’ to ‘long unsigned int&’
  135. ./../sdk/SharedUtil.Hash.hpp:260:47: error: no matching function for call to ‘SharedUtil::CMD5Hasher::GG(unsigned int&, unsigned int&, unsigned int&, unsigned int&, unsigned int&, int, unsigned int)’
  136. ./../sdk/SharedUtil.Hash.hpp:260:47: note: candidate is:
  137. ./../sdk/SharedUtil.Hash.h:49:41: note: static void SharedUtil::CMD5Hasher::GG(long unsigned int&, long unsigned int, long unsigned int, long unsigned int, long unsigned int, long unsigned int, long unsigned int)
  138. ./../sdk/SharedUtil.Hash.h:49:41: note:   no known conversion for argument 1 from ‘unsigned int’ to ‘long unsigned int&’
  139. ./../sdk/SharedUtil.Hash.hpp:263:47: error: no matching function for call to ‘SharedUtil::CMD5Hasher::HH(unsigned int&, unsigned int&, unsigned int&, unsigned int&, unsigned int&, int, unsigned int)’
  140. ./../sdk/SharedUtil.Hash.hpp:263:47: note: candidate is:
  141. ./../sdk/SharedUtil.Hash.h:50:41: note: static void SharedUtil::CMD5Hasher::HH(long unsigned int&, long unsigned int, long unsigned int, long unsigned int, long unsigned int, long unsigned int, long unsigned int)
  142. ./../sdk/SharedUtil.Hash.h:50:41: note:   no known conversion for argument 1 from ‘unsigned int’ to ‘long unsigned int&’
  143. ./../sdk/SharedUtil.Hash.hpp:264:47: error: no matching function for call to ‘SharedUtil::CMD5Hasher::HH(unsigned int&, unsigned int&, unsigned int&, unsigned int&, unsigned int&, int, unsigned int)’
  144. ./../sdk/SharedUtil.Hash.hpp:264:47: note: candidate is:
  145. ./../sdk/SharedUtil.Hash.h:50:41: note: static void SharedUtil::CMD5Hasher::HH(long unsigned int&, long unsigned int, long unsigned int, long unsigned int, long unsigned int, long unsigned int, long unsigned int)
  146. ./../sdk/SharedUtil.Hash.h:50:41: note:   no known conversion for argument 1 from ‘unsigned int’ to ‘long unsigned int&’
  147. ./../sdk/SharedUtil.Hash.hpp:265:47: error: no matching function for call to ‘SharedUtil::CMD5Hasher::HH(unsigned int&, unsigned int&, unsigned int&, unsigned int&, unsigned int&, int, int)’
  148. ./../sdk/SharedUtil.Hash.hpp:265:47: note: candidate is:
  149. ./../sdk/SharedUtil.Hash.h:50:41: note: static void SharedUtil::CMD5Hasher::HH(long unsigned int&, long unsigned int, long unsigned int, long unsigned int, long unsigned int, long unsigned int, long unsigned int)
  150. ./../sdk/SharedUtil.Hash.h:50:41: note:   no known conversion for argument 1 from ‘unsigned int’ to ‘long unsigned int&’
  151. ./../sdk/SharedUtil.Hash.hpp:266:47: error: no matching function for call to ‘SharedUtil::CMD5Hasher::HH(unsigned int&, unsigned int&, unsigned int&, unsigned int&, unsigned int&, int, unsigned int)’
  152. ./../sdk/SharedUtil.Hash.hpp:266:47: note: candidate is:
  153. ./../sdk/SharedUtil.Hash.h:50:41: note: static void SharedUtil::CMD5Hasher::HH(long unsigned int&, long unsigned int, long unsigned int, long unsigned int, long unsigned int, long unsigned int, long unsigned int)
  154. ./../sdk/SharedUtil.Hash.h:50:41: note:   no known conversion for argument 1 from ‘unsigned int’ to ‘long unsigned int&’
  155. ./../sdk/SharedUtil.Hash.hpp:267:47: error: no matching function for call to ‘SharedUtil::CMD5Hasher::HH(unsigned int&, unsigned int&, unsigned int&, unsigned int&, unsigned int&, int, unsigned int)’
  156. ./../sdk/SharedUtil.Hash.hpp:267:47: note: candidate is:
  157. ./../sdk/SharedUtil.Hash.h:50:41: note: static void SharedUtil::CMD5Hasher::HH(long unsigned int&, long unsigned int, long unsigned int, long unsigned int, long unsigned int, long unsigned int, long unsigned int)
  158. ./../sdk/SharedUtil.Hash.h:50:41: note:   no known conversion for argument 1 from ‘unsigned int’ to ‘long unsigned int&’
  159. ./../sdk/SharedUtil.Hash.hpp:268:47: error: no matching function for call to ‘SharedUtil::CMD5Hasher::HH(unsigned int&, unsigned int&, unsigned int&, unsigned int&, unsigned int&, int, int)’
  160. ./../sdk/SharedUtil.Hash.hpp:268:47: note: candidate is:
  161. ./../sdk/SharedUtil.Hash.h:50:41: note: static void SharedUtil::CMD5Hasher::HH(long unsigned int&, long unsigned int, long unsigned int, long unsigned int, long unsigned int, long unsigned int, long unsigned int)
  162. ./../sdk/SharedUtil.Hash.h:50:41: note:   no known conversion for argument 1 from ‘unsigned int’ to ‘long unsigned int&’
  163. ./../sdk/SharedUtil.Hash.hpp:269:47: error: no matching function for call to ‘SharedUtil::CMD5Hasher::HH(unsigned int&, unsigned int&, unsigned int&, unsigned int&, unsigned int&, int, unsigned int)’
  164. ./../sdk/SharedUtil.Hash.hpp:269:47: note: candidate is:
  165. ./../sdk/SharedUtil.Hash.h:50:41: note: static void SharedUtil::CMD5Hasher::HH(long unsigned int&, long unsigned int, long unsigned int, long unsigned int, long unsigned int, long unsigned int, long unsigned int)
  166. ./../sdk/SharedUtil.Hash.h:50:41: note:   no known conversion for argument 1 from ‘unsigned int’ to ‘long unsigned int&’
  167. ./../sdk/SharedUtil.Hash.hpp:270:47: error: no matching function for call to ‘SharedUtil::CMD5Hasher::HH(unsigned int&, unsigned int&, unsigned int&, unsigned int&, unsigned int&, int, unsigned int)’
  168. ./../sdk/SharedUtil.Hash.hpp:270:47: note: candidate is:
  169. ./../sdk/SharedUtil.Hash.h:50:41: note: static void SharedUtil::CMD5Hasher::HH(long unsigned int&, long unsigned int, long unsigned int, long unsigned int, long unsigned int, long unsigned int, long unsigned int)
  170. ./../sdk/SharedUtil.Hash.h:50:41: note:   no known conversion for argument 1 from ‘unsigned int’ to ‘long unsigned int&’
  171. ./../sdk/SharedUtil.Hash.hpp:271:47: error: no matching function for call to ‘SharedUtil::CMD5Hasher::HH(unsigned int&, unsigned int&, unsigned int&, unsigned int&, unsigned int&, int, int)’
  172. ./../sdk/SharedUtil.Hash.hpp:271:47: note: candidate is:
  173. ./../sdk/SharedUtil.Hash.h:50:41: note: static void SharedUtil::CMD5Hasher::HH(long unsigned int&, long unsigned int, long unsigned int, long unsigned int, long unsigned int, long unsigned int, long unsigned int)
  174. ./../sdk/SharedUtil.Hash.h:50:41: note:   no known conversion for argument 1 from ‘unsigned int’ to ‘long unsigned int&’
  175. ./../sdk/SharedUtil.Hash.hpp:272:47: error: no matching function for call to ‘SharedUtil::CMD5Hasher::HH(unsigned int&, unsigned int&, unsigned int&, unsigned int&, unsigned int&, int, unsigned int)’
  176. ./../sdk/SharedUtil.Hash.hpp:272:47: note: candidate is:
  177. ./../sdk/SharedUtil.Hash.h:50:41: note: static void SharedUtil::CMD5Hasher::HH(long unsigned int&, long unsigned int, long unsigned int, long unsigned int, long unsigned int, long unsigned int, long unsigned int)
  178. ./../sdk/SharedUtil.Hash.h:50:41: note:   no known conversion for argument 1 from ‘unsigned int’ to ‘long unsigned int&’
  179. ./../sdk/SharedUtil.Hash.hpp:273:47: error: no matching function for call to ‘SharedUtil::CMD5Hasher::HH(unsigned int&, unsigned int&, unsigned int&, unsigned int&, unsigned int&, int, unsigned int)’
  180. ./../sdk/SharedUtil.Hash.hpp:273:47: note: candidate is:
  181. ./../sdk/SharedUtil.Hash.h:50:41: note: static void SharedUtil::CMD5Hasher::HH(long unsigned int&, long unsigned int, long unsigned int, long unsigned int, long unsigned int, long unsigned int, long unsigned int)
  182. ./../sdk/SharedUtil.Hash.h:50:41: note:   no known conversion for argument 1 from ‘unsigned int’ to ‘long unsigned int&’
  183. ./../sdk/SharedUtil.Hash.hpp:274:47: error: no matching function for call to ‘SharedUtil::CMD5Hasher::HH(unsigned int&, unsigned int&, unsigned int&, unsigned int&, unsigned int&, int, int)’
  184. ./../sdk/SharedUtil.Hash.hpp:274:47: note: candidate is:
  185. ./../sdk/SharedUtil.Hash.h:50:41: note: static void SharedUtil::CMD5Hasher::HH(long unsigned int&, long unsigned int, long unsigned int, long unsigned int, long unsigned int, long unsigned int, long unsigned int)
  186. ./../sdk/SharedUtil.Hash.h:50:41: note:   no known conversion for argument 1 from ‘unsigned int’ to ‘long unsigned int&’
  187. ./../sdk/SharedUtil.Hash.hpp:275:47: error: no matching function for call to ‘SharedUtil::CMD5Hasher::HH(unsigned int&, unsigned int&, unsigned int&, unsigned int&, unsigned int&, int, unsigned int)’
  188. ./../sdk/SharedUtil.Hash.hpp:275:47: note: candidate is:
  189. ./../sdk/SharedUtil.Hash.h:50:41: note: static void SharedUtil::CMD5Hasher::HH(long unsigned int&, long unsigned int, long unsigned int, long unsigned int, long unsigned int, long unsigned int, long unsigned int)
  190. ./../sdk/SharedUtil.Hash.h:50:41: note:   no known conversion for argument 1 from ‘unsigned int’ to ‘long unsigned int&’
  191. ./../sdk/SharedUtil.Hash.hpp:276:47: error: no matching function for call to ‘SharedUtil::CMD5Hasher::HH(unsigned int&, unsigned int&, unsigned int&, unsigned int&, unsigned int&, int, unsigned int)’
  192. ./../sdk/SharedUtil.Hash.hpp:276:47: note: candidate is:
  193. ./../sdk/SharedUtil.Hash.h:50:41: note: static void SharedUtil::CMD5Hasher::HH(long unsigned int&, long unsigned int, long unsigned int, long unsigned int, long unsigned int, long unsigned int, long unsigned int)
  194. ./../sdk/SharedUtil.Hash.h:50:41: note:   no known conversion for argument 1 from ‘unsigned int’ to ‘long unsigned int&’
  195. ./../sdk/SharedUtil.Hash.hpp:277:47: error: no matching function for call to ‘SharedUtil::CMD5Hasher::HH(unsigned int&, unsigned int&, unsigned int&, unsigned int&, unsigned int&, int, int)’
  196. ./../sdk/SharedUtil.Hash.hpp:277:47: note: candidate is:
  197. ./../sdk/SharedUtil.Hash.h:50:41: note: static void SharedUtil::CMD5Hasher::HH(long unsigned int&, long unsigned int, long unsigned int, long unsigned int, long unsigned int, long unsigned int, long unsigned int)
  198. ./../sdk/SharedUtil.Hash.h:50:41: note:   no known conversion for argument 1 from ‘unsigned int’ to ‘long unsigned int&’
  199. ./../sdk/SharedUtil.Hash.hpp:278:47: error: no matching function for call to ‘SharedUtil::CMD5Hasher::HH(unsigned int&, unsigned int&, unsigned int&, unsigned int&, unsigned int&, int, unsigned int)’
  200. ./../sdk/SharedUtil.Hash.hpp:278:47: note: candidate is:
  201. ./../sdk/SharedUtil.Hash.h:50:41: note: static void SharedUtil::CMD5Hasher::HH(long unsigned int&, long unsigned int, long unsigned int, long unsigned int, long unsigned int, long unsigned int, long unsigned int)
  202. ./../sdk/SharedUtil.Hash.h:50:41: note:   no known conversion for argument 1 from ‘unsigned int’ to ‘long unsigned int&’
  203. ./../sdk/SharedUtil.Hash.hpp:281:47: error: no matching function for call to ‘SharedUtil::CMD5Hasher::II(unsigned int&, unsigned int&, unsigned int&, unsigned int&, unsigned int&, int, unsigned int)’
  204. ./../sdk/SharedUtil.Hash.hpp:281:47: note: candidate is:
  205. ./../sdk/SharedUtil.Hash.h:51:41: note: static void SharedUtil::CMD5Hasher::II(long unsigned int&, long unsigned int, long unsigned int, long unsigned int, long unsigned int, long unsigned int, long unsigned int)
  206. ./../sdk/SharedUtil.Hash.h:51:41: note:   no known conversion for argument 1 from ‘unsigned int’ to ‘long unsigned int&’
  207. ./../sdk/SharedUtil.Hash.hpp:282:47: error: no matching function for call to ‘SharedUtil::CMD5Hasher::II(unsigned int&, unsigned int&, unsigned int&, unsigned int&, unsigned int&, int, int)’
  208. ./../sdk/SharedUtil.Hash.hpp:282:47: note: candidate is:
  209. ./../sdk/SharedUtil.Hash.h:51:41: note: static void SharedUtil::CMD5Hasher::II(long unsigned int&, long unsigned int, long unsigned int, long unsigned int, long unsigned int, long unsigned int, long unsigned int)
  210. ./../sdk/SharedUtil.Hash.h:51:41: note:   no known conversion for argument 1 from ‘unsigned int’ to ‘long unsigned int&’
  211. ./../sdk/SharedUtil.Hash.hpp:283:47: error: no matching function for call to ‘SharedUtil::CMD5Hasher::II(unsigned int&, unsigned int&, unsigned int&, unsigned int&, unsigned int&, int, unsigned int)’
  212. ./../sdk/SharedUtil.Hash.hpp:283:47: note: candidate is:
  213. ./../sdk/SharedUtil.Hash.h:51:41: note: static void SharedUtil::CMD5Hasher::II(long unsigned int&, long unsigned int, long unsigned int, long unsigned int, long unsigned int, long unsigned int, long unsigned int)
  214. ./../sdk/SharedUtil.Hash.h:51:41: note:   no known conversion for argument 1 from ‘unsigned int’ to ‘long unsigned int&’
  215. ./../sdk/SharedUtil.Hash.hpp:284:47: error: no matching function for call to ‘SharedUtil::CMD5Hasher::II(unsigned int&, unsigned int&, unsigned int&, unsigned int&, unsigned int&, int, unsigned int)’
  216. ./../sdk/SharedUtil.Hash.hpp:284:47: note: candidate is:
  217. ./../sdk/SharedUtil.Hash.h:51:41: note: static void SharedUtil::CMD5Hasher::II(long unsigned int&, long unsigned int, long unsigned int, long unsigned int, long unsigned int, long unsigned int, long unsigned int)
  218. ./../sdk/SharedUtil.Hash.h:51:41: note:   no known conversion for argument 1 from ‘unsigned int’ to ‘long unsigned int&’
  219. ./../sdk/SharedUtil.Hash.hpp:285:47: error: no matching function for call to ‘SharedUtil::CMD5Hasher::II(unsigned int&, unsigned int&, unsigned int&, unsigned int&, unsigned int&, int, int)’
  220. ./../sdk/SharedUtil.Hash.hpp:285:47: note: candidate is:
  221. ./../sdk/SharedUtil.Hash.h:51:41: note: static void SharedUtil::CMD5Hasher::II(long unsigned int&, long unsigned int, long unsigned int, long unsigned int, long unsigned int, long unsigned int, long unsigned int)
  222. ./../sdk/SharedUtil.Hash.h:51:41: note:   no known conversion for argument 1 from ‘unsigned int’ to ‘long unsigned int&’
  223. ./../sdk/SharedUtil.Hash.hpp:286:47: error: no matching function for call to ‘SharedUtil::CMD5Hasher::II(unsigned int&, unsigned int&, unsigned int&, unsigned int&, unsigned int&, int, unsigned int)’
  224. ./../sdk/SharedUtil.Hash.hpp:286:47: note: candidate is:
  225. ./../sdk/SharedUtil.Hash.h:51:41: note: static void SharedUtil::CMD5Hasher::II(long unsigned int&, long unsigned int, long unsigned int, long unsigned int, long unsigned int, long unsigned int, long unsigned int)
  226. ./../sdk/SharedUtil.Hash.h:51:41: note:   no known conversion for argument 1 from ‘unsigned int’ to ‘long unsigned int&’
  227. ./../sdk/SharedUtil.Hash.hpp:287:47: error: no matching function for call to ‘SharedUtil::CMD5Hasher::II(unsigned int&, unsigned int&, unsigned int&, unsigned int&, unsigned int&, int, unsigned int)’
  228. ./../sdk/SharedUtil.Hash.hpp:287:47: note: candidate is:
  229. ./../sdk/SharedUtil.Hash.h:51:41: note: static void SharedUtil::CMD5Hasher::II(long unsigned int&, long unsigned int, long unsigned int, long unsigned int, long unsigned int, long unsigned int, long unsigned int)
  230. ./../sdk/SharedUtil.Hash.h:51:41: note:   no known conversion for argument 1 from ‘unsigned int’ to ‘long unsigned int&’
  231. ./../sdk/SharedUtil.Hash.hpp:288:47: error: no matching function for call to ‘SharedUtil::CMD5Hasher::II(unsigned int&, unsigned int&, unsigned int&, unsigned int&, unsigned int&, int, unsigned int)’
  232. ./../sdk/SharedUtil.Hash.hpp:288:47: note: candidate is:
  233. ./../sdk/SharedUtil.Hash.h:51:41: note: static void SharedUtil::CMD5Hasher::II(long unsigned int&, long unsigned int, long unsigned int, long unsigned int, long unsigned int, long unsigned int, long unsigned int)
  234. ./../sdk/SharedUtil.Hash.h:51:41: note:   no known conversion for argument 1 from ‘unsigned int’ to ‘long unsigned int&’
  235. ./../sdk/SharedUtil.Hash.hpp:289:47: error: no matching function for call to ‘SharedUtil::CMD5Hasher::II(unsigned int&, unsigned int&, unsigned int&, unsigned int&, unsigned int&, int, int)’
  236. ./../sdk/SharedUtil.Hash.hpp:289:47: note: candidate is:
  237. ./../sdk/SharedUtil.Hash.h:51:41: note: static void SharedUtil::CMD5Hasher::II(long unsigned int&, long unsigned int, long unsigned int, long unsigned int, long unsigned int, long unsigned int, long unsigned int)
  238. ./../sdk/SharedUtil.Hash.h:51:41: note:   no known conversion for argument 1 from ‘unsigned int’ to ‘long unsigned int&’
  239. ./../sdk/SharedUtil.Hash.hpp:290:47: error: no matching function for call to ‘SharedUtil::CMD5Hasher::II(unsigned int&, unsigned int&, unsigned int&, unsigned int&, unsigned int&, int, unsigned int)’
  240. ./../sdk/SharedUtil.Hash.hpp:290:47: note: candidate is:
  241. ./../sdk/SharedUtil.Hash.h:51:41: note: static void SharedUtil::CMD5Hasher::II(long unsigned int&, long unsigned int, long unsigned int, long unsigned int, long unsigned int, long unsigned int, long unsigned int)
  242. ./../sdk/SharedUtil.Hash.h:51:41: note:   no known conversion for argument 1 from ‘unsigned int’ to ‘long unsigned int&’
  243. ./../sdk/SharedUtil.Hash.hpp:291:47: error: no matching function for call to ‘SharedUtil::CMD5Hasher::II(unsigned int&, unsigned int&, unsigned int&, unsigned int&, unsigned int&, int, unsigned int)’
  244. ./../sdk/SharedUtil.Hash.hpp:291:47: note: candidate is:
  245. ./../sdk/SharedUtil.Hash.h:51:41: note: static void SharedUtil::CMD5Hasher::II(long unsigned int&, long unsigned int, long unsigned int, long unsigned int, long unsigned int, long unsigned int, long unsigned int)
  246. ./../sdk/SharedUtil.Hash.h:51:41: note:   no known conversion for argument 1 from ‘unsigned int’ to ‘long unsigned int&’
  247. ./../sdk/SharedUtil.Hash.hpp:292:47: error: no matching function for call to ‘SharedUtil::CMD5Hasher::II(unsigned int&, unsigned int&, unsigned int&, unsigned int&, unsigned int&, int, int)’
  248. ./../sdk/SharedUtil.Hash.hpp:292:47: note: candidate is:
  249. ./../sdk/SharedUtil.Hash.h:51:41: note: static void SharedUtil::CMD5Hasher::II(long unsigned int&, long unsigned int, long unsigned int, long unsigned int, long unsigned int, long unsigned int, long unsigned int)
  250. ./../sdk/SharedUtil.Hash.h:51:41: note:   no known conversion for argument 1 from ‘unsigned int’ to ‘long unsigned int&’
  251. ./../sdk/SharedUtil.Hash.hpp:293:47: error: no matching function for call to ‘SharedUtil::CMD5Hasher::II(unsigned int&, unsigned int&, unsigned int&, unsigned int&, unsigned int&, int, unsigned int)’
  252. ./../sdk/SharedUtil.Hash.hpp:293:47: note: candidate is:
  253. ./../sdk/SharedUtil.Hash.h:51:41: note: static void SharedUtil::CMD5Hasher::II(long unsigned int&, long unsigned int, long unsigned int, long unsigned int, long unsigned int, long unsigned int, long unsigned int)
  254. ./../sdk/SharedUtil.Hash.h:51:41: note:   no known conversion for argument 1 from ‘unsigned int’ to ‘long unsigned int&’
  255. ./../sdk/SharedUtil.Hash.hpp:294:47: error: no matching function for call to ‘SharedUtil::CMD5Hasher::II(unsigned int&, unsigned int&, unsigned int&, unsigned int&, unsigned int&, int, unsigned int)’
  256. ./../sdk/SharedUtil.Hash.hpp:294:47: note: candidate is:
  257. ./../sdk/SharedUtil.Hash.h:51:41: note: static void SharedUtil::CMD5Hasher::II(long unsigned int&, long unsigned int, long unsigned int, long unsigned int, long unsigned int, long unsigned int, long unsigned int)
  258. ./../sdk/SharedUtil.Hash.h:51:41: note:   no known conversion for argument 1 from ‘unsigned int’ to ‘long unsigned int&’
  259. ./../sdk/SharedUtil.Hash.hpp:295:47: error: no matching function for call to ‘SharedUtil::CMD5Hasher::II(unsigned int&, unsigned int&, unsigned int&, unsigned int&, unsigned int&, int, int)’
  260. ./../sdk/SharedUtil.Hash.hpp:295:47: note: candidate is:
  261. ./../sdk/SharedUtil.Hash.h:51:41: note: static void SharedUtil::CMD5Hasher::II(long unsigned int&, long unsigned int, long unsigned int, long unsigned int, long unsigned int, long unsigned int, long unsigned int)
  262. ./../sdk/SharedUtil.Hash.h:51:41: note:   no known conversion for argument 1 from ‘unsigned int’ to ‘long unsigned int&’
  263. ./../sdk/SharedUtil.Hash.hpp:296:47: error: no matching function for call to ‘SharedUtil::CMD5Hasher::II(unsigned int&, unsigned int&, unsigned int&, unsigned int&, unsigned int&, int, unsigned int)’
  264. ./../sdk/SharedUtil.Hash.hpp:296:47: note: candidate is:
  265. ./../sdk/SharedUtil.Hash.h:51:41: note: static void SharedUtil::CMD5Hasher::II(long unsigned int&, long unsigned int, long unsigned int, long unsigned int, long unsigned int, long unsigned int, long unsigned int)
  266. ./../sdk/SharedUtil.Hash.h:51:41: note:   no known conversion for argument 1 from ‘unsigned int’ to ‘long unsigned int&’
  267. ./../sdk/SharedUtil.Hash.hpp: At global scope:
  268. ./../sdk/SharedUtil.Hash.hpp:308:10: error: prototype for ‘void SharedUtil::CMD5Hasher::Encode(unsigned char*, unsigned int*, long unsigned int)’ does not match any in class ‘SharedUtil::CMD5Hasher’
  269. ./../sdk/SharedUtil.Hash.h:40:41: error: candidate is: static void SharedUtil::CMD5Hasher::Encode(unsigned char*, long unsigned int*, long unsigned int)
  270. ./../sdk/SharedUtil.Hash.hpp:321:10: error: prototype for ‘void SharedUtil::CMD5Hasher::Decode(unsigned int*, unsigned char*, long unsigned int)’ does not match any in class ‘SharedUtil::CMD5Hasher’
  271. ./../sdk/SharedUtil.Hash.h:41:41: error: candidate is: static void SharedUtil::CMD5Hasher::Decode(long unsigned int*, unsigned char*, long unsigned int)
  272. ./../sdk/SharedUtil.Hash.hpp:331:26: error: prototype for ‘unsigned int SharedUtil::CMD5Hasher::RotateLeft(unsigned int, unsigned int)’ does not match any in class ‘SharedUtil::CMD5Hasher’
  273. ./../sdk/SharedUtil.Hash.h:43:41: error: candidate is: static long unsigned int SharedUtil::CMD5Hasher::RotateLeft(long unsigned int, long unsigned int)
  274. ./../sdk/SharedUtil.Hash.hpp:337:26: error: prototype for ‘unsigned int SharedUtil::CMD5Hasher::F(unsigned int, unsigned int, unsigned int)’ does not match any in class ‘SharedUtil::CMD5Hasher’
  275. ./../sdk/SharedUtil.Hash.h:44:41: error: candidate is: static long unsigned int SharedUtil::CMD5Hasher::F(long unsigned int, long unsigned int, long unsigned int)
  276. ./../sdk/SharedUtil.Hash.hpp:343:26: error: prototype for ‘unsigned int SharedUtil::CMD5Hasher::G(unsigned int, unsigned int, unsigned int)’ does not match any in class ‘SharedUtil::CMD5Hasher’
  277. ./../sdk/SharedUtil.Hash.h:45:41: error: candidate is: static long unsigned int SharedUtil::CMD5Hasher::G(long unsigned int, long unsigned int, long unsigned int)
  278. ./../sdk/SharedUtil.Hash.hpp:349:26: error: prototype for ‘unsigned int SharedUtil::CMD5Hasher::H(unsigned int, unsigned int, unsigned int)’ does not match any in class ‘SharedUtil::CMD5Hasher’
  279. ./../sdk/SharedUtil.Hash.h:46:41: error: candidate is: static long unsigned int SharedUtil::CMD5Hasher::H(long unsigned int, long unsigned int, long unsigned int)
  280. ./../sdk/SharedUtil.Hash.hpp:355:26: error: prototype for ‘unsigned int SharedUtil::CMD5Hasher::I(unsigned int, unsigned int, unsigned int)’ does not match any in class ‘SharedUtil::CMD5Hasher’
  281. ./../sdk/SharedUtil.Hash.h:47:41: error: candidate is: static long unsigned int SharedUtil::CMD5Hasher::I(long unsigned int, long unsigned int, long unsigned int)
  282. In file included from ./../sdk/SharedUtil.hpp:24:0,
  283.                  from CXMLImpl.cpp:19:
  284. ./../sdk/SharedUtil.Hash.hpp:361:17: error: prototype for ‘void SharedUtil::CMD5Hasher::FF(unsigned int&, unsigned int, unsigned int, unsigned int, unsigned int, unsigned int, unsigned int)’ does not match any in class ‘SharedUtil::CMD5Hasher’
  285. ./../sdk/SharedUtil.Hash.h:48:41: error: candidate is: static void SharedUtil::CMD5Hasher::FF(long unsigned int&, long unsigned int, long unsigned int, long unsigned int, long unsigned int, long unsigned int, long unsigned int)
  286. ./../sdk/SharedUtil.Hash.hpp:368:17: error: prototype for ‘void SharedUtil::CMD5Hasher::GG(unsigned int&, unsigned int, unsigned int, unsigned int, unsigned int, unsigned int, unsigned int)’ does not match any in class ‘SharedUtil::CMD5Hasher’
  287. ./../sdk/SharedUtil.Hash.h:49:41: error: candidate is: static void SharedUtil::CMD5Hasher::GG(long unsigned int&, long unsigned int, long unsigned int, long unsigned int, long unsigned int, long unsigned int, long unsigned int)
  288. ./../sdk/SharedUtil.Hash.hpp:375:17: error: prototype for ‘void SharedUtil::CMD5Hasher::HH(unsigned int&, unsigned int, unsigned int, unsigned int, unsigned int, unsigned int, unsigned int)’ does not match any in class ‘SharedUtil::CMD5Hasher’
  289. ./../sdk/SharedUtil.Hash.h:50:41: error: candidate is: static void SharedUtil::CMD5Hasher::HH(long unsigned int&, long unsigned int, long unsigned int, long unsigned int, long unsigned int, long unsigned int, long unsigned int)
  290. ./../sdk/SharedUtil.Hash.hpp:382:17: error: prototype for ‘void SharedUtil::CMD5Hasher::II(unsigned int&, unsigned int, unsigned int, unsigned int, unsigned int, unsigned int, unsigned int)’ does not match any in class ‘SharedUtil::CMD5Hasher’
  291. ./../sdk/SharedUtil.Hash.h:51:41: error: candidate is: static void SharedUtil::CMD5Hasher::II(long unsigned int&, long unsigned int, long unsigned int, long unsigned int, long unsigned int, long unsigned int, long unsigned int)
  292. ./../sdk/SharedUtil.Hash.hpp: In function ‘void SharedUtil::TeaEncode(const SString&, const SString&, SString*)’:
  293. ./../sdk/SharedUtil.Hash.hpp:592:38: warning: dereferencing type-punned pointer will break strict-aliasing rules [-Wstrict-aliasing]
  294. ./../sdk/SharedUtil.Hash.hpp:597:34: warning: dereferencing type-punned pointer will break strict-aliasing rules [-Wstrict-aliasing]
  295. ./../sdk/SharedUtil.Hash.h: At global scope:
  296. ./../sdk/SharedUtil.Hash.h:48:41: warning: inline function ‘static void SharedUtil::CMD5Hasher::FF(long unsigned int&, long unsigned int, long unsigned int, long unsigned int, long unsigned int, long unsigned int, long unsigned int)’ used but never defined [enabled by default]
  297. ./../sdk/SharedUtil.Hash.h:49:41: warning: inline function ‘static void SharedUtil::CMD5Hasher::GG(long unsigned int&, long unsigned int, long unsigned int, long unsigned int, long unsigned int, long unsigned int, long unsigned int)’ used but never defined [enabled by default]
  298. ./../sdk/SharedUtil.Hash.h:50:41: warning: inline function ‘static void SharedUtil::CMD5Hasher::HH(long unsigned int&, long unsigned int, long unsigned int, long unsigned int, long unsigned int, long unsigned int, long unsigned int)’ used but never defined [enabled by default]
  299. ./../sdk/SharedUtil.Hash.h:51:41: warning: inline function ‘static void SharedUtil::CMD5Hasher::II(long unsigned int&, long unsigned int, long unsigned int, long unsigned int, long unsigned int, long unsigned int, long unsigned int)’ used but never defined [enabled by default]
  300. ./../sdk/SharedUtil.File.hpp: In function ‘SString SharedUtil::GetSystemCurrentDirectory()’:
  301. ./../sdk/SharedUtil.File.hpp:301:38: warning: ignoring return value of ‘char* getcwd(char*, size_t)’, declared with attribute warn_unused_result [-Wunused-result]
  302. make[4]: *** [xmll_la-CXMLImpl.lo] Error 1
  303. make[4]: Leaving directory `/mnt/sda/mtasa-blue-read-only/Shared/XML'
  304. make[3]: *** [all] Error 2
  305. make[3]: Leaving directory `/mnt/sda/mtasa-blue-read-only/Shared/XML'
  306. make[2]: *** [all-recursive] Error 1
  307. make[2]: Leaving directory `/mnt/sda/mtasa-blue-read-only/Shared'
  308. make[1]: *** [all-recursive] Error 1
  309. make[1]: Leaving directory `/mnt/sda/mtasa-blue-read-only'
  310. make: *** [all] Error 2
  311.  

Reply to "Untitled"

Here you can reply to the paste above